Information card for entry 7204747
Common name | Cobalt Phosphate |
Formula | C3 H9 Co0.5 N O4 P |
Calculated formula | C3 H9 Co0.5 N O4 P |
Title of publication | Open-framework zinc and cobalt phosphates synthesized by the tributylphosphate routeElectronic supplementary information (ESI) available: Tables S1?16: Atomic coordinates, equivalent isotropic displacement parameters and bond lengths and angles for compounds I?VII. See http://www.rsc.org/suppdata/jm/b3/b311529a/ |
Authors of publication | Neeraj, S.; Rao, C. N. R.; Cheetham, Anthony K. |
Journal of publication | Journal of Materials Chemistry |
Year of publication | 2004 |
Journal volume | 14 |
Journal issue | 5 |
Pages of publication | 814 |
a | 11.939 ± 0.002 Å |
b | 13.803 ± 0.003 Å |
c | 7.9473 ± 0.0015 Å |
α | 90° |
β | 91.514 ± 0.003° |
γ | 90° |
Cell volume | 1309.2 ± 0.4 Å3 |
Cell temperature | 293 ± 2 K |
Ambient diffraction temperature | 293 ± 2 K |
Number of distinct elements | 6 |
Space group number | 15 |
Hermann-Mauguin space group symbol | C 1 2/c 1 |
Hall space group symbol | -C 2yc |
Residual factor for all reflections | 0.0384 |
Residual factor for significantly intense reflections | 0.0343 |
Weighted residual factors for significantly intense reflections | 0.1059 |
Weighted residual factors for all reflections included in the refinement | 0.1078 |
Goodness-of-fit parameter for all reflections included in the refinement | 1.134 |
Diffraction radiation wavelength | 0.71073 Å |
Diffraction radiation type | MoKα |