Information card for entry 7204756
Formula | C86 H150 Cd11 N10 O5 Se19 Zn5 |
Calculated formula | C86 Cd11 N10 O5 Se19 Zn5 |
SMILES | [Cd]12([Se]3[Cd]45[Se]6[Cd]7([Se]([Cd]89[Se]1[Zn]1([Se]%10%11[Cd]%12%13[Se]2[Zn]2([Se]4[Cd]4%14[Se](c%15ccccc%15)[Cd]%15([Se]4([Cd]4([Se]7[Zn]7([Se]8[Cd]8%10[Se](c%10ccccc%10)[Cd]%11([Se]([Cd]([Se]48)([Se]%13%14)[Se]%15c4ccccc4)c4ccccc4)[Se]c4ccccc4)[N](CC[N]7(C)C)(C)C)[Se]59%12)[Zn]46[N](CC[N]4(C)C)(C)C)[Se]c4ccccc4)[N](CC[N]2(C)C)(C)C)[N](CC[N]1(C)C)(C)C)[Zn]13[N](CC[N]1(C)C)(C)C)[O]1CCCC1)[O]1CCCC1.O1CCCC1.O1CCCC1.O1CCCC1 |
Title of publication | Molecular nanocluster analogues of CdSe/ZnSe and CdTe/ZnTe core/shell nanoparticles |
Authors of publication | DeGroot, Marty W.; Taylor, Nicholas J.; Corrigan, John F. |
Journal of publication | Journal of Materials Chemistry |
Year of publication | 2004 |
Journal volume | 14 |
Journal issue | 4 |
Pages of publication | 654 |
a | 17.3933 ± 0.0014 Å |
b | 36.592 ± 0.003 Å |
c | 46.151 ± 0.004 Å |
α | 90° |
β | 90° |
γ | 90° |
Cell volume | 29373 ± 4 Å3 |
Cell temperature | 150 ± 1 K |
Ambient diffraction temperature | 150 ± 1 K |
Number of distinct elements | 7 |
Space group number | 61 |
Hermann-Mauguin space group symbol | P b c a |
Hall space group symbol | -P 2ac 2ab |
Residual factor for all reflections | 0.1625 |
Residual factor for significantly intense reflections | 0.0927 |
Weighted residual factors for significantly intense reflections | 0.2018 |
Weighted residual factors for all reflections included in the refinement | 0.2183 |
Goodness-of-fit parameter for all reflections included in the refinement | 1.176 |
Diffraction radiation wavelength | 0.71073 Å |
Diffraction radiation type | MoKα |