Information card for entry 7204772
External links | ChemSpider |
Chemical name | 1-(4-n-propoxytetrafluorophenyl)-2-phenylacetylene |
Formula | C17 H12 F4 O |
Calculated formula | C17 H12 F4 O |
SMILES | Fc1c(OCCC)c(F)c(F)c(c1F)C#Cc1ccccc1 |
Title of publication | Arene-perfluoroarene interactions in crystal engineering: structural preferences in polyfluorinated tolansArene?perfluoroarene interactions in crystal engineering. Part 9. Presented in part at the 16th International Symposium on Fluorine Chemistry, University of Durham, 2000. Abstract 1P-102. For part 8 see ref. 1.Electronic supplementary information (ESI) available: spectroscopic characterisation for 4b?k; plots of energy as a function of inter-ring torsion angle in 1,2,3,4,5-pentafluorotolan and as a function of C(Ph)?C(Ph)?O?C(Me) torsion angle in PhOMe. See http://www.rsc.org/suppdata/jm/b3/b314094f/ |
Authors of publication | Smith, Caroline E.; Smith, Philip S.; Thomas, Rhodri Ll.; Robins, Edward G.; Collings, Jonathan C.; Dai, Chaoyang; Scott, Andrew J.; Borwick, Simon; Batsanov, Andrei S.; Watt, Stephen W.; Clark, Stewart J.; Viney, Christopher; Howard, Judith A. K.; Clegg, William; Marder, Todd B. |
Journal of publication | Journal of Materials Chemistry |
Year of publication | 2004 |
Journal volume | 14 |
Journal issue | 3 |
Pages of publication | 413 |
a | 7.752 ± 0.002 Å |
b | 8.652 ± 0.002 Å |
c | 11.119 ± 0.003 Å |
α | 98.57 ± 0.01° |
β | 108.81 ± 0.01° |
γ | 92.06 ± 0.01° |
Cell volume | 695.2 ± 0.3 Å3 |
Cell temperature | 120 ± 2 K |
Ambient diffraction temperature | 120 ± 2 K |
Number of distinct elements | 4 |
Space group number | 2 |
Hermann-Mauguin space group symbol | P -1 |
Hall space group symbol | -P 1 |
Residual factor for all reflections | 0.0448 |
Residual factor for significantly intense reflections | 0.0403 |
Weighted residual factors for significantly intense reflections | 0.1101 |
Weighted residual factors for all reflections included in the refinement | 0.1154 |
Goodness-of-fit parameter for all reflections included in the refinement | 1.041 |
Diffraction radiation wavelength | 0.71073 Å |
Diffraction radiation type | MoKα |