Information card for entry 7204779
Common name | none |
Chemical name | 3,3'-bis-(4-fluorophenyl)-3H,3'H-[2,2']biindenylidene-1,1'-dione |
Formula | C30 H18 F2 O2 |
Calculated formula | C30 H18 F2 O2 |
SMILES | c1cccc2c1C(=O)/C(=C1\[C@@H](c3ccccc3C1=O)c1ccc(cc1)F)[C@@H]2c1ccc(cc1)F.c1cccc2c1C(=O)/C(=C1\[C@H](c3ccccc3C1=O)c1ccc(cc1)F)[C@H]2c1ccc(cc1)F |
Title of publication | Guest-dependent photochromism of 3,3?-bis-(4-fluoro-phenyl)-3H,3?H- [2,2?]biindenylidene-1,1?-dione in its inclusion crystals |
Authors of publication | Tanaka, Koichi; Yamamoto, Yohei; Caira, Mino R. |
Journal of publication | CrystEngComm |
Year of publication | 2004 |
Journal volume | 6 |
Journal issue | 2 |
Pages of publication | 1 |
a | 12.8638 ± 0.0002 Å |
b | 15.8214 ± 0.0002 Å |
c | 16.1334 ± 0.0002 Å |
α | 88.14 ± 0.001° |
β | 88.037 ± 0.001° |
γ | 84.747 ± 0.001° |
Cell volume | 3266.4 ± 0.08 Å3 |
Cell temperature | 203 ± 2 K |
Ambient diffraction temperature | 203 ± 2 K |
Number of distinct elements | 4 |
Space group number | 2 |
Hermann-Mauguin space group symbol | P -1 |
Hall space group symbol | -P 1 |
Residual factor for all reflections | 0.0922 |
Residual factor for significantly intense reflections | 0.069 |
Weighted residual factors for significantly intense reflections | 0.1949 |
Weighted residual factors for all reflections included in the refinement | 0.2069 |
Goodness-of-fit parameter for all reflections included in the refinement | 1.121 |
Diffraction radiation wavelength | 0.71073 Å |
Diffraction radiation type | MoKα |