Information card for entry 7204834
Chemical name | 2-(2,6-dichlorophenyl)benzimidazolyl-N,N'-dioxide |
Formula | C13 H7 Cl2 N2 O2 |
Calculated formula | C13 H7 Cl2 N2 O2 |
SMILES | Clc1c(C2=N(=O)c3ccccc3[N]2=O)c(Cl)ccc1 |
Title of publication | Synthesis, structural, and magnetic characterization of substituted benzoimidazole-l-yl N,N?-dioxides |
Authors of publication | Zakrassov, Alexander; Shteiman, Vitaly; Sheynin, Yana; Tumanskii, Boris; Botoshansky, Mark; Kapon, Moshe; Keren, Amit; Kaftory, Menahem; Vos, Thomas E.; Miller, Joel S. |
Journal of publication | Journal of Materials Chemistry |
Year of publication | 2004 |
Journal volume | 14 |
Journal issue | 12 |
Pages of publication | 1827 |
a | 7.58 ± 0.001 Å |
b | 8.003 ± 0.002 Å |
c | 11.652 ± 0.002 Å |
α | 88.6 ± 0.02° |
β | 74.12 ± 0.02° |
γ | 68.84 ± 0.02° |
Cell volume | 631.8 ± 0.2 Å3 |
Cell temperature | 293 ± 2 K |
Ambient diffraction temperature | 293 ± 2 K |
Number of distinct elements | 5 |
Space group number | 2 |
Hermann-Mauguin space group symbol | P -1 |
Hall space group symbol | -P 1 |
Residual factor for all reflections | 0.1348 |
Residual factor for significantly intense reflections | 0.0503 |
Weighted residual factors for significantly intense reflections | 0.0981 |
Weighted residual factors for all reflections included in the refinement | 0.117 |
Goodness-of-fit parameter for all reflections included in the refinement | 0.899 |
Diffraction radiation wavelength | 0.71073 Å |
Diffraction radiation type | MoKα |