Information card for entry 7204839
Chemical name | 2-(2,3,6-trichlorophenyl)benzimidazolyl-N,N'-dioxide |
Formula | C13 H6 Cl3 N2 O2 |
Calculated formula | C13 H6 Cl3 N2 O2 |
SMILES | Clc1c(C2=N(=O)c3ccccc3[N]2=O)c(Cl)ccc1Cl |
Title of publication | Synthesis, structural, and magnetic characterization of substituted benzoimidazole-l-yl N,N?-dioxides |
Authors of publication | Zakrassov, Alexander; Shteiman, Vitaly; Sheynin, Yana; Tumanskii, Boris; Botoshansky, Mark; Kapon, Moshe; Keren, Amit; Kaftory, Menahem; Vos, Thomas E.; Miller, Joel S. |
Journal of publication | Journal of Materials Chemistry |
Year of publication | 2004 |
Journal volume | 14 |
Journal issue | 12 |
Pages of publication | 1827 |
a | 8.47 ± 0.001 Å |
b | 12.701 ± 0.002 Å |
c | 12.44 ± 0.002 Å |
α | 90° |
β | 93.79 ± 0.02° |
γ | 90° |
Cell volume | 1335.3 ± 0.3 Å3 |
Cell temperature | 293 ± 2 K |
Ambient diffraction temperature | 293 ± 2 K |
Number of distinct elements | 5 |
Space group number | 14 |
Hermann-Mauguin space group symbol | P 1 21/c 1 |
Hall space group symbol | -P 2ybc |
Residual factor for all reflections | 0.109 |
Residual factor for significantly intense reflections | 0.0401 |
Weighted residual factors for significantly intense reflections | 0.0887 |
Weighted residual factors for all reflections included in the refinement | 0.1055 |
Goodness-of-fit parameter for all reflections included in the refinement | 0.825 |
Diffraction radiation wavelength | 0.71073 Å |
Diffraction radiation type | MoKα |