Information card for entry 7204862
Formula | C6 H26 Co3 N6 O28 P4 W4 |
Calculated formula | C6 H26 Co3 N6 O28 P4 W4 |
Title of publication | Hydrothermal synthesis, structures and catalytic properties of the new open-framework cobalt tungsten phosphates (enH2)3[Co3W4P4O28] and K6[Co3W4P4O28]�4H2O |
Authors of publication | Yan, Bangbo; Goh, Ngoh K.; Chia, Lian S.; Stucky, Galen D. |
Journal of publication | Journal of Materials Chemistry |
Year of publication | 2004 |
Journal volume | 14 |
Journal issue | 10 |
Pages of publication | 1567 |
a | 17.0947 ± 0.0011 Å |
b | 17.0947 ± 0.0011 Å |
c | 10.7531 ± 0.0008 Å |
α | 90° |
β | 90° |
γ | 90° |
Cell volume | 3142.4 ± 0.4 Å3 |
Cell temperature | 297 ± 2 K |
Ambient diffraction temperature | 297 ± 2 K |
Number of distinct elements | 7 |
Space group number | 88 |
Hermann-Mauguin space group symbol | I 41/a :2 |
Hall space group symbol | -I 4ad |
Residual factor for all reflections | 0.0623 |
Residual factor for significantly intense reflections | 0.0399 |
Weighted residual factors for significantly intense reflections | 0.0838 |
Weighted residual factors for all reflections included in the refinement | 0.0911 |
Goodness-of-fit parameter for all reflections included in the refinement | 1.05 |
Diffraction radiation wavelength | 0.71073 Å |
Diffraction radiation type | MoKα |