Information card for entry 7205032
Common name | zinc amidomethylphosphonate |
Formula | C2 H6 N O5 P Zn |
Calculated formula | C2 H4 N O5 P Zn |
Title of publication | Strategies for the synthesis of porous metal phosphonate materialsBasis of a presentation given at Materials Discussion No. 5, 22???25 September 2002, Madrid, Spain. |
Authors of publication | Hix, Gary B.; Turner, Adele; Kariuki, Benson M.; Tremayne, Maryjane; MacLean, Elizabeth J. |
Journal of publication | Journal of Materials Chemistry |
Year of publication | 2002 |
Journal volume | 12 |
Journal issue | 11 |
Pages of publication | 3220 |
a | 9.556 ± 0.0013 Å |
b | 12.611 ± 0.002 Å |
c | 5.2318 ± 0.0008 Å |
α | 90° |
β | 90° |
γ | 90° |
Cell volume | 630.49 ± 0.16 Å3 |
Cell temperature | 296 ± 2 K |
Ambient diffraction temperature | 296 ± 2 K |
Number of distinct elements | 6 |
Space group number | 33 |
Hermann-Mauguin space group symbol | P n a 21 |
Hall space group symbol | P 2c -2n |
Residual factor for all reflections | 0.0313 |
Residual factor for significantly intense reflections | 0.0311 |
Weighted residual factors for significantly intense reflections | 0.0831 |
Weighted residual factors for all reflections included in the refinement | 0.0833 |
Goodness-of-fit parameter for all reflections included in the refinement | 1.085 |
Diffraction radiation wavelength | 0.71069 Å |
Diffraction radiation type | MoKα |