Information card for entry 7206166
Formula | C52 H44 Cl N8 O5.25 Ru2 |
Calculated formula | C52 H44 Cl N8 O4.92 Ru2 |
Title of publication | Microwave methods for the synthesis of paddlewheel diruthenium compounds with N,N-donor ligands |
Authors of publication | Herrero, Santiago; Jiménez-Aparicio, Reyes; Perles, Josefina; Priego, José L.; Saguar, Susana; Urbanos, Francisco A. |
Journal of publication | Green Chemistry |
Year of publication | 2011 |
Journal volume | 13 |
Journal issue | 7 |
Pages of publication | 1885 |
a | 15.028 ± 0.002 Å |
b | 15.028 ± 0.002 Å |
c | 21.962 ± 0.004 Å |
α | 90° |
β | 90° |
γ | 90° |
Cell volume | 4959.9 ± 1.3 Å3 |
Cell temperature | 293 ± 2 K |
Ambient diffraction temperature | 293 ± 2 K |
Number of distinct elements | 6 |
Space group number | 130 |
Hermann-Mauguin space group symbol | P 4/n c c :2 |
Hall space group symbol | -P 4a 2ac |
Residual factor for all reflections | 0.1307 |
Residual factor for significantly intense reflections | 0.0471 |
Weighted residual factors for significantly intense reflections | 0.1055 |
Weighted residual factors for all reflections included in the refinement | 0.1679 |
Goodness-of-fit parameter for all reflections included in the refinement | 1.089 |
Diffraction radiation wavelength | 0.71073 Å |
Diffraction radiation type | MoKα |