Information card for entry 7208636
Formula | C66 H59 Br4 Eu0.25 N10 O11 Tb0.75 Zn2 |
Calculated formula | C66 H53 Br4 Eu0.25 N10 O11 Tb0.75 Zn2 |
Title of publication | Functional heterometallic coordination polymers with metalloligands as tunable luminescent crystalline materials |
Authors of publication | Du, Dong-Ying; Qin, Jun-Sheng; Sun, Cheng-Xin; Wang, Xin-Long; Zhang, Shu-Ran; Shen, Ping; Li, Shun-Li; Su, Zhong-Min; Lan, Ya-Qian |
Journal of publication | Journal of Materials Chemistry |
Year of publication | 2012 |
Journal volume | 22 |
Journal issue | 37 |
Pages of publication | 19673 |
a | 15.676 ± 0.002 Å |
b | 13.514 ± 0.0017 Å |
c | 33.055 ± 0.004 Å |
α | 90° |
β | 99.803 ± 0.002° |
γ | 90° |
Cell volume | 6900.3 ± 1.5 Å3 |
Cell temperature | 293 ± 2 K |
Ambient diffraction temperature | 293 ± 2 K |
Number of distinct elements | 8 |
Space group number | 14 |
Hermann-Mauguin space group symbol | P 1 21/n 1 |
Hall space group symbol | -P 2yn |
Residual factor for all reflections | 0.1149 |
Residual factor for significantly intense reflections | 0.0557 |
Weighted residual factors for significantly intense reflections | 0.1512 |
Weighted residual factors for all reflections included in the refinement | 0.1786 |
Goodness-of-fit parameter for all reflections included in the refinement | 1.029 |
Diffraction radiation wavelength | 0.71069 Å |
Diffraction radiation type | MoKα |