Information card for entry 7208853
Formula | C56 H66 S12 |
Calculated formula | C56 H66 S12 |
Title of publication | Targeting ordered oligothiophene fibers with enhanced functional properties by interplay of self-assembly and wet lithography |
Authors of publication | Gentili, Denis; Di Maria, Francesca; Liscio, Fabiola; Ferlauto, Laura; Leonardi, Francesca; Maini, Lucia; Gazzano, Massimo; Milita, Silvia; Barbarella, Giovanna; Cavallini, Massimiliano |
Journal of publication | Journal of Materials Chemistry |
Year of publication | 2012 |
Journal volume | 22 |
Journal issue | 39 |
Pages of publication | 20852 |
a | 5.1756 ± 0.0002 Å |
b | 16.4142 ± 0.0006 Å |
c | 17.0191 ± 0.0006 Å |
α | 84.227 ± 0.003° |
β | 85.377 ± 0.003° |
γ | 82.2 ± 0.004° |
Cell volume | 1421.9 ± 0.09 Å3 |
Cell temperature | 293 ± 2 K |
Ambient diffraction temperature | 293 ± 2 K |
Number of distinct elements | 3 |
Space group number | 2 |
Hermann-Mauguin space group symbol | P -1 |
Hall space group symbol | -P 1 |
Residual factor for all reflections | 0.1301 |
Residual factor for significantly intense reflections | 0.0926 |
Weighted residual factors for significantly intense reflections | 0.1635 |
Weighted residual factors for all reflections included in the refinement | 0.1787 |
Goodness-of-fit parameter for all reflections included in the refinement | 1.227 |
Diffraction radiation wavelength | 0.71073 Å |
Diffraction radiation type | MoKα |