Information card for entry 7209363
Chemical name |
Sr Ag2 Sn2 |
Formula |
Ag2 Sn2 Sr |
Calculated formula |
Ag2 Sn2 Sr |
Title of publication |
Neue Verbindungen A B2 X2 (A= Erdalkalimetall, B= Uebergangselement, X= Element(IV)) im ThCr2Si2-Typ |
Authors of publication |
Niess, N.; Schaefer, H.; Doerrscheidt, W. |
Journal of publication |
Zeitschrift fuer Naturforschung, Teil B. Anorganische Chemie, Organische Chemie (2,1947-32,1977) |
Year of publication |
1976 |
Journal volume |
31 |
Pages of publication |
890 - 891 |
a |
4.67 Å |
b |
4.67 Å |
c |
11.73 Å |
α |
90° |
β |
90° |
γ |
90° |
Cell volume |
255.818 Å3 |
Number of distinct elements |
3 |
Space group number |
139 |
Hermann-Mauguin space group symbol |
I 4/m m m |
Hall space group symbol |
-I 4 2 |
Yes |
No |
No |