Information card for entry 7209385
Chemical name |
Eu Au In2 |
Formula |
Au Eu In2 |
Calculated formula |
Au Eu In2 |
Title of publication |
New indides Eu Au In2, Eu Pd In4, Gd Rh In2, Yb Rh In4, and Yb Pd In4 |
Authors of publication |
Kal'ichak, Ya.M.; Hoffmann, R.D.; Poettgen, R.; Zaremba, V.I. |
Journal of publication |
Zeitschrift fuer Naturforschung, Teil B. Anorganische Chemie, Organische Chemie (42,1987-) |
Year of publication |
2000 |
Journal volume |
55 |
Pages of publication |
834 - 840 |
a |
4.681 Å |
b |
11.055 Å |
c |
7.535 Å |
α |
90° |
β |
90° |
γ |
90° |
Cell volume |
389.925 Å3 |
Number of distinct elements |
3 |
Space group number |
63 |
Hermann-Mauguin space group symbol |
C m c m |
Hall space group symbol |
-C 2c 2 |
Yes |
No |
No |