Information card for entry 7209406
Chemical name |
Eu2 Au2 Sn5 |
Formula |
Au2 Eu2 Sn5 |
Calculated formula |
Au2 Eu2 Sn5 |
Title of publication |
Structure and properties of the stannide Eu2 Au2 Sn5, and its relationship with the family of Ba Al4-related structures |
Authors of publication |
Kussmann, D.; Mosel, B.D.; Rodewald, U.C.; Rosenhahn, C.; Kuennen, B.; Kotzyba, G.; Poettgen, R. |
Journal of publication |
Zeitschrift fuer Naturforschung, Teil B. Anorganische Chemie, Organische Chemie (42,1987-) |
Year of publication |
1999 |
Journal volume |
54 |
Pages of publication |
1155 - 1164 |
a |
9.286 Å |
b |
4.658 Å |
c |
10.429 Å |
α |
90° |
β |
92.28° |
γ |
90° |
Cell volume |
450.741 Å3 |
Number of distinct elements |
3 |
Space group number |
11 |
Hermann-Mauguin space group symbol |
P 1 21/m 1 |
Hall space group symbol |
-P 2yb |
Yes |
No |
No |