Information card for entry 7211887
Formula | C65 H53 Mn4 N3 O19 |
Calculated formula | C65 H53 Mn4 N3 O19 |
Title of publication | Metal‒organic frameworks of manganese(ii) 4,4′-biphenyldicarboxylates: crystal structures, hydrogen adsorption, and magnetism properties |
Authors of publication | Zhong, Rui-Qin; Zou, Ru-Qiang; Du, Miao; Yamada, Tetsuya; Maruta, Goro; Takeda, Sadamu; Li, Jing; Xu, Qiang |
Journal of publication | CrystEngComm |
Year of publication | 2010 |
Journal volume | 12 |
Journal issue | 3 |
Pages of publication | 677 |
a | 13.819 ± 0.003 Å |
b | 15.382 ± 0.003 Å |
c | 24.383 ± 0.005 Å |
α | 100.41 ± 0.03° |
β | 95.25 ± 0.03° |
γ | 101.09 ± 0.03° |
Cell volume | 4959 ± 2 Å3 |
Cell temperature | 293 ± 2 K |
Ambient diffraction temperature | 293 ± 2 K |
Number of distinct elements | 5 |
Space group number | 2 |
Hermann-Mauguin space group symbol | P -1 |
Hall space group symbol | -P 1 |
Residual factor for all reflections | 0.0817 |
Residual factor for significantly intense reflections | 0.0635 |
Weighted residual factors for significantly intense reflections | 0.1788 |
Weighted residual factors for all reflections included in the refinement | 0.198 |
Goodness-of-fit parameter for all reflections included in the refinement | 0.981 |
Diffraction radiation wavelength | 0.71073 Å |
Diffraction radiation type | MoKα |