Information card for entry 7211890
Formula | C23 H20 N4 O7 Zn |
Calculated formula | C23 H20 N4 O7 Zn |
Title of publication | Syntheses, structures, photoluminescence and magnetic properties of five compounds with 1,3,5-benzenetricarboxylate acid and imidazole ligands |
Authors of publication | Xu, Jiao; Pan, Zhaorui; Wang, Tianwei; Li, Yizhi; Guo, Zijian; Batten, Stuart R.; Zheng, Hegen |
Journal of publication | CrystEngComm |
Year of publication | 2010 |
Journal volume | 12 |
Journal issue | 2 |
Pages of publication | 612 |
a | 7.8282 ± 0.0013 Å |
b | 16.447 ± 0.003 Å |
c | 16.779 ± 0.003 Å |
α | 90° |
β | 95.137 ± 0.003° |
γ | 90° |
Cell volume | 2151.6 ± 0.7 Å3 |
Cell temperature | 293 ± 2 K |
Ambient diffraction temperature | 293 ± 2 K |
Number of distinct elements | 5 |
Space group number | 14 |
Hermann-Mauguin space group symbol | P 1 21/n 1 |
Hall space group symbol | -P 2yn |
Residual factor for all reflections | 0.0858 |
Residual factor for significantly intense reflections | 0.052 |
Weighted residual factors for significantly intense reflections | 0.0972 |
Weighted residual factors for all reflections included in the refinement | 0.1053 |
Goodness-of-fit parameter for all reflections included in the refinement | 1.004 |
Diffraction radiation wavelength | 0.71073 Å |
Diffraction radiation type | MoKα |