Information card for entry 7212285
Formula | C41 H36 N4 O14 Zn2 |
Calculated formula | C41 H36 N4 O14 Zn2 |
Title of publication | A 4-connected 3D porous coordination polymer with a binodal 6284 net built on tetrahedral quadridentate and bidentate linkers |
Authors of publication | Ren, Shi-Bin; Zhou, Le; Zhang, Jun; Zhu, You-Long; Li, Yi-Zhi; Du, Hong-Bin; You, Xiao-Zeng |
Journal of publication | CrystEngComm |
Year of publication | 2010 |
Journal volume | 12 |
Journal issue | 5 |
Pages of publication | 1635 |
a | 9.3402 ± 0.001 Å |
b | 25.842 ± 0.003 Å |
c | 20.09 ± 0.002 Å |
α | 90° |
β | 101.431 ± 0.001° |
γ | 90° |
Cell volume | 4752.9 ± 0.9 Å3 |
Cell temperature | 291 ± 2 K |
Ambient diffraction temperature | 291 ± 2 K |
Number of distinct elements | 5 |
Space group number | 15 |
Hermann-Mauguin space group symbol | C 1 2/c 1 |
Hall space group symbol | -C 2yc |
Residual factor for all reflections | 0.0544 |
Residual factor for significantly intense reflections | 0.0458 |
Weighted residual factors for significantly intense reflections | 0.1059 |
Weighted residual factors for all reflections included in the refinement | 0.108 |
Goodness-of-fit parameter for all reflections included in the refinement | 1.136 |
Diffraction radiation wavelength | 0.71073 Å |
Diffraction radiation type | MoKα |