Information card for entry 7212354
Formula | C14 H17 N4 Na Ni O4 |
Calculated formula | C14 H17 N4 Na Ni O4 |
Title of publication | Solvent effects on the assembly of Ni/Na coordination polymers from reactions of [Ni(acac)2(H2O)2] with sodium dicyanamide |
Authors of publication | Chen, Xi; Qiao, Shan-Bao; Liu, Dong; Lang, Jian-Ping; Zhang, Yong; Xu, Cheng; Ma, Shu-Lin |
Journal of publication | CrystEngComm |
Year of publication | 2010 |
Journal volume | 12 |
Journal issue | 5 |
Pages of publication | 1610 |
a | 22.33 ± 0.004 Å |
b | 10.9143 ± 0.0015 Å |
c | 17.122 ± 0.003 Å |
α | 90° |
β | 116.89 ± 0.004° |
γ | 90° |
Cell volume | 3721.7 ± 1.1 Å3 |
Cell temperature | 193 ± 2 K |
Ambient diffraction temperature | 193 ± 2 K |
Number of distinct elements | 6 |
Space group number | 15 |
Hermann-Mauguin space group symbol | C 1 2/c 1 |
Hall space group symbol | -C 2yc |
Residual factor for all reflections | 0.0582 |
Residual factor for significantly intense reflections | 0.0458 |
Weighted residual factors for significantly intense reflections | 0.0926 |
Weighted residual factors for all reflections included in the refinement | 0.0982 |
Goodness-of-fit parameter for all reflections included in the refinement | 1.112 |
Diffraction radiation wavelength | 0.7107 Å |
Diffraction radiation type | MoKα |