Information card for entry 7212402
Formula | C75.8 H63.2 Br3 Mn3 N9 O15 |
Calculated formula | C75.8 H63.2 Br3 Mn3 N9 O15 |
Title of publication | Not just size and shape: spherically symmetrical d5 and d10 metal ions give different coordination nets with 4,2′:6′,4″-terpyridines |
Authors of publication | Constable, Edwin C.; Zhang, Guoqi; Coronado, Eugenio; Housecroft, Catherine E.; Neuburger, Markus |
Journal of publication | CrystEngComm |
Year of publication | 2010 |
Journal volume | 12 |
Journal issue | 7 |
Pages of publication | 2139 |
a | 26.2828 ± 0.0019 Å |
b | 13.503 ± 0.0009 Å |
c | 21.8199 ± 0.0016 Å |
α | 90° |
β | 106.818 ± 0.004° |
γ | 90° |
Cell volume | 7412.6 ± 0.9 Å3 |
Cell temperature | 123 K |
Ambient diffraction temperature | 123 K |
Number of distinct elements | 6 |
Space group number | 14 |
Hermann-Mauguin space group symbol | P 1 21/c 1 |
Hall space group symbol | -P 2ybc |
Residual factor for all reflections | 0.1143 |
Residual factor for significantly intense reflections | 0.0444 |
Weighted residual factors for all reflections | 0.0769 |
Weighted residual factors for significantly intense reflections | 0.0465 |
Weighted residual factors for all reflections included in the refinement | 0.0465 |
Goodness-of-fit parameter for all reflections included in the refinement | 1.1229 |
Diffraction radiation wavelength | 0.71073 Å |
Diffraction radiation type | MoKα |