Information card for entry 7212765
Chemical name | (N-5-bromo-2-pyridyl)-acetamide)2, fumaric acid |
Formula | C18 H20 Br2 N4 O6 |
Calculated formula | C18 H20 Br2 N4 O6 |
SMILES | Brc1ccc(nc1)NC(=O)C.C(=O)(O)CCC(=O)O.Brc1ccc(nc1)NC(=O)C |
Title of publication | Mapping out the synthetic landscape for re-crystallization, co-crystallization and salt formation |
Authors of publication | Aakeröy, Christer B.; Rajbanshi, Arbin; Li, Z. Jane; Desper, John |
Journal of publication | CrystEngComm |
Year of publication | 2010 |
Journal volume | 12 |
Journal issue | 12 |
Pages of publication | 4231 |
a | 4.9878 ± 0.0003 Å |
b | 9.9931 ± 0.0007 Å |
c | 11.4625 ± 0.0008 Å |
α | 113.25 ± 0.005° |
β | 92.103 ± 0.005° |
γ | 93.352 ± 0.005° |
Cell volume | 522.92 ± 0.06 Å3 |
Cell temperature | 100 ± 2 K |
Ambient diffraction temperature | 100 ± 2 K |
Number of distinct elements | 5 |
Space group number | 2 |
Hermann-Mauguin space group symbol | P -1 |
Hall space group symbol | -P 1 |
Residual factor for all reflections | 0.0784 |
Residual factor for significantly intense reflections | 0.0414 |
Weighted residual factors for significantly intense reflections | 0.084 |
Weighted residual factors for all reflections included in the refinement | 0.0973 |
Goodness-of-fit parameter for all reflections included in the refinement | 0.978 |
Diffraction radiation wavelength | 0.71073 Å |
Diffraction radiation type | MoKα |