Information card for entry 7212916
Formula | C22 H24 N4 O4 S |
Calculated formula | C22 H24 N4 O4 S |
SMILES | s1c(/N=C/c2n(ccc2)C)c(c(c1/N=C/c1n(ccc1)C)C(=O)OCC)C(=O)OCC |
Title of publication | Towards materials with reversible oxidation and tuneable colours using heterocyclic conjugated azomethines |
Authors of publication | Dufresne, Stéphane; Bolduc, Andréanne; Skene, W. G. |
Journal of publication | Journal of Materials Chemistry |
Year of publication | 2010 |
Journal volume | 20 |
Journal issue | 23 |
Pages of publication | 4861 |
a | 13.7006 ± 0.0003 Å |
b | 16.7642 ± 0.0004 Å |
c | 20.2638 ± 0.0005 Å |
α | 90° |
β | 101.869 ± 0.001° |
γ | 90° |
Cell volume | 4554.68 ± 0.19 Å3 |
Cell temperature | 220 ± 2 K |
Ambient diffraction temperature | 220 ± 2 K |
Number of distinct elements | 5 |
Space group number | 14 |
Hermann-Mauguin space group symbol | P 1 21/c 1 |
Hall space group symbol | -P 2ybc |
Residual factor for all reflections | 0.0536 |
Residual factor for significantly intense reflections | 0.0475 |
Weighted residual factors for significantly intense reflections | 0.1353 |
Weighted residual factors for all reflections included in the refinement | 0.141 |
Goodness-of-fit parameter for all reflections included in the refinement | 1.075 |
Diffraction radiation wavelength | 1.54178 Å |
Diffraction radiation type | CuKα |