Information card for entry 7212928
Formula | C36 H38 O4 |
Calculated formula | C36 H38 O4 |
SMILES | c1(c(cc(cc1C)C)C)c1c2cc(OC)c(OC)cc2c(c2c(cc(cc2C)C)C)c2cc(OC)c(OC)cc12 |
Title of publication | High performance organic light-emitting diodes based on tetra(methoxy)-containing anthracene derivatives as a hole transport and electron-blocking layer |
Authors of publication | Xia, Zhen-Yuan; Su, Jian-Hua; Wong, Wai-Yeung; Wang, Lei; Cheah, Kok-Wai; Tian, He; Chen, Chin H. |
Journal of publication | Journal of Materials Chemistry |
Year of publication | 2010 |
Journal volume | 20 |
Journal issue | 38 |
Pages of publication | 8382 |
a | 8.187 ± 0.002 Å |
b | 21.305 ± 0.006 Å |
c | 8.621 ± 0.003 Å |
α | 90° |
β | 93.215 ± 0.006° |
γ | 90° |
Cell volume | 1501.3 ± 0.8 Å3 |
Cell temperature | 173 ± 2 K |
Ambient diffraction temperature | 173 ± 2 K |
Number of distinct elements | 3 |
Space group number | 14 |
Hermann-Mauguin space group symbol | P 1 21/c 1 |
Hall space group symbol | -P 2ybc |
Residual factor for all reflections | 0.1283 |
Residual factor for significantly intense reflections | 0.0717 |
Weighted residual factors for significantly intense reflections | 0.1797 |
Weighted residual factors for all reflections included in the refinement | 0.213 |
Goodness-of-fit parameter for all reflections included in the refinement | 0.982 |
Diffraction radiation wavelength | 0.71073 Å |
Diffraction radiation type | MoKα |