Information card for entry 7212987
Formula | C36 H52 Cl2 Cu N4 O20 |
Calculated formula | C18 H26 Cl Cu0.5 N2 O10 |
Title of publication | Synthesis and structural analysis of copper(II) pyridine amide complexes as HIV-1 protease inhibitors |
Authors of publication | Lebon, Florence; Ledecq, Marie; Benatallah, Zohra; Sicsic, Sames; Lapouyade, René; Kahn, Olivier; Garçon, Arnaud; Reboud-Ravaux, Michèle; Durant, François |
Journal of publication | Journal of the Chemical Society, Perkin Transactions 2 |
Year of publication | 1999 |
Journal issue | 4 |
Pages of publication | 795 |
a | 10.974 ± 0.001 Å |
b | 11.421 ± 0.001 Å |
c | 11.698 ± 0.001 Å |
α | 114.18 ± 0.004° |
β | 93.573 ± 0.005° |
γ | 116.809 ± 0.006° |
Cell volume | 1137.5 ± 0.2 Å3 |
Cell temperature | 293 ± 2 K |
Ambient diffraction temperature | 293 ± 2 K |
Number of distinct elements | 6 |
Space group number | 2 |
Hermann-Mauguin space group symbol | P -1 |
Hall space group symbol | -P 1 |
Residual factor for all reflections | 0.0493 |
Residual factor for significantly intense reflections | 0.0473 |
Weighted residual factors for all reflections | 0.1416 |
Weighted residual factors for significantly intense reflections | 0.1375 |
Goodness-of-fit parameter for all reflections | 1.082 |
Goodness-of-fit parameter for significantly intense reflections | 1.1 |
Diffraction radiation wavelength | 1.54179 Å |
Diffraction radiation type | CuKa |