Information card for entry 7213005
Formula | C24 H30 N6 O4 |
Calculated formula | C24 H30 N6 O4 |
Title of publication | Oligopyridine bis(nitronyl nitroxides): synthesis, structures, electrochemical, magnetic and electronic properties |
Authors of publication | Ziessel, Raymond; Ulrich, Gilles; Lawson, Raphael C.; Echegoyen, Luis |
Journal of publication | Journal of Materials Chemistry |
Year of publication | 1999 |
Journal volume | 9 |
Journal issue | 7 |
Pages of publication | 1435 |
a | 17.216 ± 0.005 Å |
b | 10.832 ± 0.003 Å |
c | 6.247 ± 0.002 Å |
α | 90° |
β | 95.71 ± 0.02° |
γ | 90° |
Cell volume | 1159.2 ± 0.6 Å3 |
Cell temperature | 173 K |
Ambient diffraction temperature | 173 K |
Number of distinct elements | 4 |
Space group number | 14 |
Hermann-Mauguin space group symbol | P 1 21/n 1 |
Hall space group symbol | -P 2yn |
Residual factor for all reflections | 0.05 |
Residual factor for significantly intense reflections | 0.04 |
Weighted residual factors for all reflections | 0.061 |
Weighted residual factors for all reflections included in the refinement | 0.06 |
Goodness-of-fit parameter for all reflections | 0.999 |
Goodness-of-fit parameter for all reflections included in the refinement | 1.113 |
Diffraction radiation wavelength | 1.54184 Å |
Diffraction radiation type | Cu-Kα |