Information card for entry 7213055
Formula | H12 N2 O10 P2 V |
Calculated formula | N2 O10 P2 V |
Title of publication | Influence of reaction conditions on the electrochemical-hydrothermal synthesis of two ammonium vanadium phosphates: (NH4)2VO(HPO4)2·H2O and (NH4)2VO(V0.88P1.12O7) |
Authors of publication | Liu, Lumei; Wang, Xiqu; Bontchev, Ranko; Ross, Kent; Jacobson, Allan J. |
Journal of publication | Journal of Materials Chemistry |
Year of publication | 1999 |
Journal volume | 9 |
Journal issue | 7 |
Pages of publication | 1585 |
a | 7.2499 ± 0.0008 Å |
b | 8.1244 ± 0.0009 Å |
c | 8.6529 ± 0.0009 Å |
α | 73.472 ± 0.002° |
β | 80.085 ± 0.002° |
γ | 85.077 ± 0.002° |
Cell volume | 480.94 ± 0.09 Å3 |
Cell temperature | 293 ± 2 K |
Ambient diffraction temperature | 293 ± 2 K |
Number of distinct elements | 5 |
Space group number | 1 |
Hermann-Mauguin space group symbol | P 1 |
Hall space group symbol | P 1 |
Residual factor for all reflections | 0.1001 |
Residual factor for significantly intense reflections | 0.0797 |
Weighted residual factors for all reflections | 0.2045 |
Weighted residual factors for significantly intense reflections | 0.1937 |
Goodness-of-fit parameter for all reflections | 0.995 |
Goodness-of-fit parameter for significantly intense reflections | 1.096 |
Diffraction radiation wavelength | 0.71073 Å |
Diffraction radiation type | MoKα |