Information card for entry 7213148
Formula |
C36 H42 Br2 Cl3 I S24 |
Calculated formula |
C36 Br2 Cl3 I S24 |
Title of publication |
Crystal structures and optical properties of cation radical salts of a tetrathiafulvalene trisannulated macrocycle |
Authors of publication |
Akutagawa, Tomoyuki; Abe, Yukako; Hasegawa, Tatsuo; Nakamura, Takayoshi; Inabe, Tamotsu; Sugiura, Kenich; Sakata, Yoshiteru; Christensen, Christian A.; Lau, Jesper; Becher, Jan |
Journal of publication |
Journal of Materials Chemistry |
Year of publication |
1999 |
Journal volume |
9 |
Journal issue |
11 |
Pages of publication |
2737 |
a |
13.656 ± 0.005 Å |
b |
20.254 ± 0.004 Å |
c |
12.638 ± 0.004 Å |
α |
104.75 ± 0.02° |
β |
116.18 ± 0.03° |
γ |
81.57 ± 0.02° |
Cell volume |
3031.2 ± 1.8 Å3 |
Cell temperature |
173.5 K |
Number of distinct elements |
6 |
Space group number |
2 |
Hermann-Mauguin space group symbol |
P -1 |
Hall space group symbol |
-P 1 |
Residual factor for significantly intense reflections |
0.079 |
Weighted residual factors for significantly intense reflections |
0.0878 |
Goodness-of-fit parameter for all reflections |
3.506 |
Diffraction radiation wavelength |
0.7107 Å |
Diffraction radiation type |
MoKα |
Yes |
No |
No |