Information card for entry 7213414
Formula | C6 H15 O5 P S |
Calculated formula | C6 H15 O5 P S |
SMILES | S(=O)(=O)(C)CP(=O)(OCC)OCC |
Title of publication | Comparative spectroscopic and theoretical studies on the conformation of some α-diethoxyphosphoryl carbonyl compounds and their α-ethylsulfonyl analogues 1 |
Authors of publication | Olivato, Paulo R.; Filho, Rubens Ruiz; Zukerman-Schpector, Julio; Dal Colle, Maurizio; Distefano, Giuseppe |
Journal of publication | Journal of the Chemical Society, Perkin Transactions 2 |
Year of publication | 2001 |
Journal issue | 1 |
Pages of publication | 97 |
a | 10.074 ± 0.001 Å |
b | 8.357 ± 0.0009 Å |
c | 13.991 ± 0.002 Å |
α | 90° |
β | 108.46 ± 0.01° |
γ | 90° |
Cell volume | 1117.3 ± 0.2 Å3 |
Cell temperature | 293 K |
Ambient diffraction temperature | 293 ± 2 K |
Number of distinct elements | 5 |
Space group number | 14 |
Hermann-Mauguin space group symbol | P 1 21/a 1 |
Hall space group symbol | -P 2yab |
Residual factor for all reflections | 0.0699 |
Residual factor for significantly intense reflections | 0.0453 |
Weighted residual factors for significantly intense reflections | 0.1197 |
Weighted residual factors for all reflections included in the refinement | 0.1349 |
Goodness-of-fit parameter for all reflections included in the refinement | 1.048 |
Diffraction radiation wavelength | 0.71073 Å |
Diffraction radiation type | MoKα |