Information card for entry 7213543
Formula | C20 H6 Cl5 N0 O15 Zn3 |
Calculated formula | C20 H6 Cl5 O15 Zn3 |
Title of publication | Selective gas adsorption within a five-connected porous metal‒organic framework |
Authors of publication | Xue, Ming; Zhang, Zhangjing; Xiang, Shengchang; Jin, Zhao; Liang, Chengdu; Zhu, Guang-Shan; Qiu, Shi-Lun; Chen, Banglin |
Journal of publication | Journal of Materials Chemistry |
Year of publication | 2010 |
Journal volume | 20 |
Journal issue | 19 |
Pages of publication | 3984 |
a | 44.792 ± 0.003 Å |
b | 12.3416 ± 0.0007 Å |
c | 20.7246 ± 0.001 Å |
α | 90° |
β | 114.539 ± 0.002° |
γ | 90° |
Cell volume | 10421.9 ± 1.1 Å3 |
Cell temperature | 243 ± 2 K |
Ambient diffraction temperature | 243 ± 2 K |
Number of distinct elements | 6 |
Space group number | 15 |
Hermann-Mauguin space group symbol | C 1 2/c 1 |
Hall space group symbol | -C 2yc |
Residual factor for all reflections | 0.1013 |
Residual factor for significantly intense reflections | 0.0616 |
Weighted residual factors for significantly intense reflections | 0.1296 |
Weighted residual factors for all reflections included in the refinement | 0.1368 |
Goodness-of-fit parameter for all reflections included in the refinement | 1.041 |
Diffraction radiation wavelength | 0.71073 Å |
Diffraction radiation type | MoKα |