Information card for entry 7214219
Formula | C4 H6 Mn O5 |
Calculated formula | C4 H6 Mn O5 |
Title of publication | Syntheses, crystal structures and magnetic properties of five new manganese(ii) complexes: influence of the conformation of different alkyl/aryl substituted malonate ligands on the crystal packing |
Authors of publication | Déniz, Mariadel; Hernández-Rodríguez, Irene; Pasán, Jorge; Fabelo, Oscar; Cañadillas-Delgado, Laura; Vallejo, Julia; Julve, Miguel; Lloret, Francesc; Ruiz-Pérez, Catalina |
Journal of publication | CrystEngComm |
Year of publication | 2014 |
Journal volume | 16 |
Journal issue | 13 |
Pages of publication | 2766 |
a | 8.2063 ± 0.0005 Å |
b | 8.2062 ± 0.0005 Å |
c | 9.3823 ± 0.001 Å |
α | 90° |
β | 90° |
γ | 90° |
Cell volume | 631.83 ± 0.09 Å3 |
Cell temperature | 293 ± 2 K |
Ambient diffraction temperature | 293 ± 2 K |
Number of distinct elements | 4 |
Space group number | 33 |
Hermann-Mauguin space group symbol | P n a 21 |
Hall space group symbol | P 2c -2n |
Residual factor for all reflections | 0.0312 |
Residual factor for significantly intense reflections | 0.0244 |
Weighted residual factors for significantly intense reflections | 0.0438 |
Weighted residual factors for all reflections included in the refinement | 0.0456 |
Goodness-of-fit parameter for all reflections included in the refinement | 1.108 |
Diffraction radiation probe | x-ray |
Diffraction radiation wavelength | 0.71073 Å |
Diffraction radiation type | MoKα |