Information card for entry 7214528
Formula | C8 H4 Cu N0 O4 |
Calculated formula | C8 H4 Cu O4 |
Title of publication | MnII, CuII and CoII coordination polymers showing antiferromagnetism, and the coexistence of spin frustration and long range magnetic ordering |
Authors of publication | Li, Ya-Min; Xiao, Chang-Yu; Zhang, Xu-Dong; Xu, Yan-Qing; Lun, Hui-Jie; Niu, Jing-Yang |
Journal of publication | CrystEngComm |
Year of publication | 2013 |
Journal volume | 15 |
Journal issue | 38 |
Pages of publication | 7756 |
a | 13.171 ± 0.005 Å |
b | 5.1292 ± 0.0018 Å |
c | 11.719 ± 0.004 Å |
α | 90° |
β | 110.745 ± 0.006° |
γ | 90° |
Cell volume | 740.4 ± 0.5 Å3 |
Cell temperature | 296 ± 2 K |
Ambient diffraction temperature | 296 ± 2 K |
Number of distinct elements | 5 |
Space group number | 14 |
Hermann-Mauguin space group symbol | P 1 21/c 1 |
Hall space group symbol | -P 2ybc |
Residual factor for all reflections | 0.0535 |
Residual factor for significantly intense reflections | 0.0444 |
Weighted residual factors for significantly intense reflections | 0.107 |
Weighted residual factors for all reflections included in the refinement | 0.1106 |
Goodness-of-fit parameter for all reflections included in the refinement | 1.064 |
Diffraction radiation wavelength | 0.71073 Å |
Diffraction radiation type | MoKα |