Information card for entry 7215085
Common name | bishydroxylammonium bis-1N-oxidotetrazolate |
Chemical name | bishydroxylammonium bis-1N-oxidotetrazolate |
Formula | C2 H8 N10 O4 |
Calculated formula | C2 H8 N10 O4 |
SMILES | c1(n(nnn1)[O-])c1n(nnn1)[O-].O[NH3+].[NH3+]O |
Title of publication | Pushing the limits of energetic materials ‒ the synthesis and characterization of dihydroxylammonium 5,5′-bistetrazole-1,1′-diolate |
Authors of publication | Fischer, Niko; Fischer, Dennis; Klapötke, Thomas M.; Piercey, Davin G.; Stierstorfer, Jörg |
Journal of publication | Journal of Materials Chemistry |
Year of publication | 2012 |
Journal volume | 22 |
Journal issue | 38 |
Pages of publication | 20418 |
a | 5.4408 ± 0.0006 Å |
b | 11.7514 ± 0.0013 Å |
c | 6.5612 ± 0.0009 Å |
α | 90° |
β | 95.071 ± 0.011° |
γ | 90° |
Cell volume | 417.86 ± 0.09 Å3 |
Cell temperature | 298 K |
Ambient diffraction temperature | 298 K |
Number of distinct elements | 4 |
Space group number | 14 |
Hermann-Mauguin space group symbol | P 1 21/c 1 |
Hall space group symbol | -P 2ybc |
Residual factor for all reflections | 0.0469 |
Residual factor for significantly intense reflections | 0.0344 |
Weighted residual factors for significantly intense reflections | 0.0835 |
Weighted residual factors for all reflections included in the refinement | 0.0915 |
Goodness-of-fit parameter for all reflections included in the refinement | 1.024 |
Diffraction radiation wavelength | 0.71073 Å |
Diffraction radiation type | MoKα |