Information card for entry 7215097
Formula | H344 Mn40 Mo96 Na24 O634 P68 |
Calculated formula | Mn40 Mo96 Na24 O634 P68 |
Title of publication | Redox-active polyoxometalate-based crystalline material-immobilized noble metal nanoparticles: spontaneous reduction and synergistic catalytic activity |
Authors of publication | Du, Dong-Ying; Qin, Jun-Sheng; Wang, Chun-Gang; Liu, Xian-Chun; Li, Shun-Li; Su, Zhong-Min; Wang, Xin-Long; Lan, Ya-Qian; Wang, En-Bo |
Journal of publication | Journal of Materials Chemistry |
Year of publication | 2012 |
Journal volume | 22 |
Journal issue | 39 |
Pages of publication | 21040 |
a | 27.088 ± 0.0013 Å |
b | 27.088 ± 0.0013 Å |
c | 41.255 ± 0.0014 Å |
α | 90 ± 0.001° |
β | 90 ± 0.001° |
γ | 90 ± 0.001° |
Cell volume | 30271 ± 2 Å3 |
Cell temperature | 293 ± 2 K |
Ambient diffraction temperature | 293 ± 2 K |
Number of distinct elements | 6 |
Space group number | 142 |
Hermann-Mauguin space group symbol | I 41/a c d :2 |
Hall space group symbol | -I 4bd 2c |
Residual factor for all reflections | 0.0574 |
Residual factor for significantly intense reflections | 0.0451 |
Weighted residual factors for significantly intense reflections | 0.1305 |
Weighted residual factors for all reflections included in the refinement | 0.1393 |
Goodness-of-fit parameter for all reflections included in the refinement | 1.075 |
Diffraction radiation wavelength | 0.71069 Å |
Diffraction radiation type | MoKα |