Information card for entry 7215100
Formula | C28 H20 N2 O Pt |
Calculated formula | C28 H20 N2 O Pt |
SMILES | [Pt]12(c3ccccc3c3[n]1cccc3)[N](=Cc1c(O2)cccc1)c1c2ccccc2ccc1 |
Title of publication | Rational design of metallophosphors with tunable aggregation-induced phosphorescent emission and their promising applications in time-resolved luminescence assay and targeted luminescence imaging of cancer cells |
Authors of publication | Liu, Shujuan; Sun, Huibin; Ma, Yun; Ye, Shanghui; Liu, Xiangmei; Zhou, Xinhui; Mou, Xin; Wang, Lianhui; Zhao, Qiang; Huang, Wei |
Journal of publication | Journal of Materials Chemistry |
Year of publication | 2012 |
Journal volume | 22 |
Journal issue | 41 |
Pages of publication | 22167 |
a | 19.293 ± 0.009 Å |
b | 6.181 ± 0.003 Å |
c | 17.682 ± 0.008 Å |
α | 90° |
β | 93.298 ± 0.006° |
γ | 90° |
Cell volume | 2105.1 ± 1.7 Å3 |
Cell temperature | 293 ± 2 K |
Ambient diffraction temperature | 293 ± 2 K |
Number of distinct elements | 5 |
Space group number | 14 |
Hermann-Mauguin space group symbol | P 1 21/c 1 |
Hall space group symbol | -P 2ybc |
Residual factor for all reflections | 0.0509 |
Residual factor for significantly intense reflections | 0.0353 |
Weighted residual factors for significantly intense reflections | 0.0747 |
Weighted residual factors for all reflections included in the refinement | 0.0791 |
Goodness-of-fit parameter for all reflections included in the refinement | 0.893 |
Diffraction radiation wavelength | 0.71073 Å |
Diffraction radiation type | MoKα |