Information card for entry 7215107
Formula | C8 H14 N20 O3 |
Calculated formula | C8 H14 N20 O3 |
SMILES | c1(c(c2[n-]nnn2)non1)Oc1c(c2[n-]nnn2)non1.C(=[NH2+])(N)NN.C(=[NH2+])(N)NN |
Title of publication | Oxy-bridged bis(1H-tetrazol-5-yl)furazan and its energetic salts paired with nitrogen-rich cations: highly thermally stable energetic materials with low sensitivity |
Authors of publication | Liang, Lixuan; Huang, Haifeng; Wang, Kai; Bian, Chengming; Song, Jinhong; Ling, Liming; Zhao, Fengqi; Zhou, Zhiming |
Journal of publication | Journal of Materials Chemistry |
Year of publication | 2012 |
Journal volume | 22 |
Journal issue | 41 |
Pages of publication | 21954 |
a | 10.223 ± 0.004 Å |
b | 12.234 ± 0.004 Å |
c | 14.849 ± 0.005 Å |
α | 90° |
β | 107.163 ± 0.004° |
γ | 90° |
Cell volume | 1774.4 ± 1.1 Å3 |
Cell temperature | 153 ± 2 K |
Ambient diffraction temperature | 153 ± 2 K |
Number of distinct elements | 4 |
Space group number | 15 |
Hermann-Mauguin space group symbol | C 1 2/c 1 |
Hall space group symbol | -C 2yc |
Residual factor for all reflections | 0.0642 |
Residual factor for significantly intense reflections | 0.0423 |
Weighted residual factors for significantly intense reflections | 0.0907 |
Weighted residual factors for all reflections included in the refinement | 0.0997 |
Goodness-of-fit parameter for all reflections included in the refinement | 0.999 |
Diffraction radiation wavelength | 0.71073 Å |
Diffraction radiation type | MoKα |