Information card for entry 7215115
Formula | C26 H19.2 Mn N5 O4.1 |
Calculated formula | C26 H19.2 Mn N5 O4.1 |
Title of publication | Multifunctional amino-decorated metal‒organic frameworks: nonlinear-optic, ferroelectric, fluorescence sensing and photocatalytic properties |
Authors of publication | Wen, Lili; Zhou, Li; Zhang, Bingguang; Meng, Xianggao; Qu, Hua; Li, Dongfeng |
Journal of publication | Journal of Materials Chemistry |
Year of publication | 2012 |
Journal volume | 22 |
Journal issue | 42 |
Pages of publication | 22603 |
a | 34.569 ± 0.003 Å |
b | 17.656 ± 0.002 Å |
c | 20.504 ± 0.002 Å |
α | 90° |
β | 108.326 ± 0.003° |
γ | 90° |
Cell volume | 11880 ± 2 Å3 |
Cell temperature | 291 ± 2 K |
Ambient diffraction temperature | 291 ± 2 K |
Number of distinct elements | 5 |
Space group number | 9 |
Hermann-Mauguin space group symbol | C 1 c 1 |
Hall space group symbol | C -2yc |
Residual factor for all reflections | 0.0733 |
Residual factor for significantly intense reflections | 0.057 |
Weighted residual factors for significantly intense reflections | 0.1299 |
Weighted residual factors for all reflections included in the refinement | 0.1342 |
Goodness-of-fit parameter for all reflections included in the refinement | 1.047 |
Diffraction radiation wavelength | 0.71073 Å |
Diffraction radiation type | MoKα |