Information card for entry 7216339
Chemical name | net-[bis(μ-iodo)-(μ-4,4'-bipyridyl)-cadmium(ii)] (Compound 15, 270K data) |
Formula | C10 H8 Cd I2 N2 |
Calculated formula | C10 H8 Cd I2 N2 |
Title of publication | Structural trends in one and two dimensional coordination polymers of cadmium(ii) with halide bridges and pyridine-type ligands |
Authors of publication | Hu, Chunhua; Li, Qi; Englert, Ulli |
Journal of publication | CrystEngComm |
Year of publication | 2003 |
Journal volume | 5 |
Journal issue | 94 |
Pages of publication | 519 |
a | 11.792 ± 0.002 Å |
b | 13.118 ± 0.003 Å |
c | 4.1585 ± 0.0009 Å |
α | 90° |
β | 90° |
γ | 90° |
Cell volume | 643.3 ± 0.2 Å3 |
Cell temperature | 270 ± 2 K |
Ambient diffraction temperature | 270 ± 2 K |
Number of distinct elements | 5 |
Space group number | 65 |
Hermann-Mauguin space group symbol | C m m m |
Hall space group symbol | -C 2 2 |
Residual factor for all reflections | 0.0362 |
Residual factor for significantly intense reflections | 0.0281 |
Weighted residual factors for significantly intense reflections | 0.0625 |
Weighted residual factors for all reflections included in the refinement | 0.0658 |
Goodness-of-fit parameter for all reflections included in the refinement | 1.101 |
Diffraction radiation wavelength | 0.71073 Å |
Diffraction radiation type | MoKα |