Information card for entry 7217115
Formula | C40 H40 Br8 N8 O10 Zn2 |
Calculated formula | C40 H40 Br8 N8 O10 Zn2 |
Title of publication | Three mixed-ligand coordination networks modulated by flexible N-donor ligands: syntheses, topological structures, and temperature-sensitive luminescence properties |
Authors of publication | Yan, Zhi-Hao; Han, Lu-Lu; Zhao, Ya-Qin; Li, Xiao-Yu; Wang, Xing-Po; Wang, Lei; Sun, Di |
Journal of publication | CrystEngComm |
Year of publication | 2014 |
Journal volume | 16 |
Journal issue | 37 |
Pages of publication | 8747 |
a | 14.333 ± 0.006 Å |
b | 21.282 ± 0.008 Å |
c | 17.076 ± 0.007 Å |
α | 90° |
β | 91.043 ± 0.007° |
γ | 90° |
Cell volume | 5208 ± 4 Å3 |
Cell temperature | 298 ± 2 K |
Ambient diffraction temperature | 298 ± 2 K |
Number of distinct elements | 6 |
Space group number | 14 |
Hermann-Mauguin space group symbol | P 1 21/c 1 |
Hall space group symbol | -P 2ybc |
Residual factor for all reflections | 0.1736 |
Residual factor for significantly intense reflections | 0.1 |
Weighted residual factors for significantly intense reflections | 0.2657 |
Weighted residual factors for all reflections included in the refinement | 0.3123 |
Goodness-of-fit parameter for all reflections included in the refinement | 1.04 |
Diffraction radiation wavelength | 0.71073 Å |
Diffraction radiation type | MoKα |