Information card for entry 7219174
Formula | C6 H28 Mo3 N14 O2 Re3 S8 Zn3 |
Calculated formula | C6 H24.48 Mo3 N14 O1.98 Re3 S8 Zn3 |
Title of publication | Novel ‘anti-Prussian blue’ structure based on Zn2+nodes and [Re3Mo3S8(CN)6]6−heterometallic cluster spacers and its rearrangement to Prussian blue |
Authors of publication | Virovets, Alexander V.; Gayfulin, Yakov M.; Peresypkina, Eugenia V.; Mironov, Yuri V.; Naumov, Nikolay G. |
Journal of publication | CrystEngComm |
Year of publication | 2015 |
Journal volume | 17 |
Journal issue | 6 |
Pages of publication | 1477 |
a | 14.774 ± 0.002 Å |
b | 14.774 ± 0.002 Å |
c | 14.774 ± 0.002 Å |
α | 90° |
β | 90° |
γ | 90° |
Cell volume | 3224.7 ± 0.8 Å3 |
Cell temperature | 150 ± 0.2 K |
Ambient diffraction temperature | 150 ± 0.2 K |
Number of distinct elements | 8 |
Space group number | 225 |
Hermann-Mauguin space group symbol | F m -3 m |
Hall space group symbol | -F 4 2 3 |
Residual factor for all reflections | 0.0535 |
Residual factor for significantly intense reflections | 0.0433 |
Weighted residual factors for significantly intense reflections | 0.1079 |
Weighted residual factors for all reflections included in the refinement | 0.1169 |
Goodness-of-fit parameter for all reflections included in the refinement | 1.178 |
Diffraction radiation wavelength | 0.71073 Å |
Diffraction radiation type | MoKα |