Information card for entry 7219516
Chemical name | 3-Chloroisonicotinic acid |
Formula | C6 H4 Cl N O2 |
Calculated formula | C6 H4 Cl N O2 |
SMILES | Clc1cnccc1C(=O)O |
Title of publication | Polymorphism and solid-to-solid phase transitions of a simple organic molecule, 3-chloroisonicotinic acid |
Authors of publication | Long, Sihui; Zhou, Panpan; Parkin, Sean; Li, Tonglei |
Journal of publication | CrystEngComm |
Year of publication | 2015 |
Journal volume | 17 |
Journal issue | 11 |
Pages of publication | 2389 |
a | 7.3267 ± 0.0002 Å |
b | 6.6413 ± 0.0002 Å |
c | 12.6512 ± 0.0004 Å |
α | 90° |
β | 92.2254 ± 0.0015° |
γ | 90° |
Cell volume | 615.13 ± 0.03 Å3 |
Cell temperature | 90 ± 2 K |
Ambient diffraction temperature | 90 ± 2 K |
Number of distinct elements | 5 |
Space group number | 14 |
Hermann-Mauguin space group symbol | P 1 21/n 1 |
Hall space group symbol | -P 2yn |
Residual factor for all reflections | 0.0284 |
Residual factor for significantly intense reflections | 0.0254 |
Weighted residual factors for significantly intense reflections | 0.0743 |
Weighted residual factors for all reflections included in the refinement | 0.0764 |
Goodness-of-fit parameter for all reflections included in the refinement | 1.039 |
Diffraction radiation wavelength | 0.71073 Å |
Diffraction radiation type | MoKα |