Information card for entry 7219641
Chemical name | (2-chloro-4-nitrobenzoic acid)(2-bromopyridine) |
Formula | C12 H8 Br Cl N2 O4 |
Calculated formula | C12 H8 Br Cl N2 O4 |
SMILES | c1(c(cc(cc1)N(=O)=O)Cl)C(=O)O.c1(ccccn1)Br |
Title of publication | Co-crystals and molecular salts of carboxylic acid/pyridine complexes: can calculated pKa's predict proton transfer? A case study of nine complexes |
Authors of publication | Lemmerer, Andreas; Govindraju, Stefan; Johnston, Marcelle; Motloung, Xolani; Savig, Kelsey L. |
Journal of publication | CrystEngComm |
Year of publication | 2015 |
Journal volume | 17 |
Journal issue | 19 |
Pages of publication | 3591 |
a | 8.2583 ± 0.0007 Å |
b | 9.0938 ± 0.0007 Å |
c | 9.1385 ± 0.0007 Å |
α | 88.094 ± 0.005° |
β | 77.372 ± 0.005° |
γ | 80.171 ± 0.005° |
Cell volume | 659.86 ± 0.09 Å3 |
Cell temperature | 173 ± 2 K |
Ambient diffraction temperature | 173 ± 2 K |
Number of distinct elements | 6 |
Space group number | 2 |
Hermann-Mauguin space group symbol | P -1 |
Hall space group symbol | -P 1 |
Residual factor for all reflections | 0.0727 |
Residual factor for significantly intense reflections | 0.0562 |
Weighted residual factors for significantly intense reflections | 0.1446 |
Weighted residual factors for all reflections included in the refinement | 0.1579 |
Goodness-of-fit parameter for all reflections included in the refinement | 1.007 |
Diffraction radiation wavelength | 0.71073 Å |
Diffraction radiation type | MoKα |