Information card for entry 7219677
Common name | catena{(mu2-adipate)-bis(pyridine-4-aldoxime)copper(II)} |
Formula | C18 H20 Cu N4 O6 |
Calculated formula | C18 H20 Cu N4 O6 |
Title of publication | Structure and mechanical features of one-dimensional coordination polymer catena-{(μ2-adipato-O,O′)-bis(pyridine-4-aldoxime)-copper(ii)} |
Authors of publication | Croitor, Lilia; Grabco, Daria Z.; Coropceanu, Eduard B.; Pyrtsac, Constantin; Fonari, Marina S. |
Journal of publication | CrystEngComm |
Year of publication | 2015 |
Journal volume | 17 |
Journal issue | 12 |
Pages of publication | 2450 |
a | 7.7444 ± 0.0007 Å |
b | 8.2359 ± 0.0008 Å |
c | 8.8697 ± 0.0008 Å |
α | 66.62 ± 0.009° |
β | 71.005 ± 0.008° |
γ | 82.957 ± 0.008° |
Cell volume | 490.99 ± 0.09 Å3 |
Cell temperature | 293 ± 2 K |
Ambient diffraction temperature | 293 ± 2 K |
Number of distinct elements | 5 |
Space group number | 2 |
Hermann-Mauguin space group symbol | P -1 |
Hall space group symbol | -P 1 |
Residual factor for all reflections | 0.0434 |
Residual factor for significantly intense reflections | 0.0393 |
Weighted residual factors for significantly intense reflections | 0.0948 |
Weighted residual factors for all reflections included in the refinement | 0.1 |
Goodness-of-fit parameter for all reflections included in the refinement | 0.999 |
Diffraction radiation wavelength | 0.71073 Å |
Diffraction radiation type | MoKα |