Information card for entry 7219769
Formula | C18 H24 Cd F6 N8 O2 Si |
Calculated formula | C18 H24 Cd F6 N8 O2 Si |
Title of publication | Guest-containing supramolecular isomers of silver(i) 3,5-dialkyl-1,2,4-triazolates: syntheses, structures, and structural transformation behaviours |
Authors of publication | Yang, Xiao; Wang, Yu; Zhou, Hao-Long; Liu, Yi-Jiang; He, Chun-Ting; Lin, Rui-Biao; Zhang, Jie-Peng |
Journal of publication | CrystEngComm |
Year of publication | 2015 |
Journal volume | 17 |
Journal issue | 46 |
Pages of publication | 8843 |
a | 10.3992 ± 0.0009 Å |
b | 21.9601 ± 0.0018 Å |
c | 10.45 ± 0.0009 Å |
α | 90° |
β | 91.022 ± 0.002° |
γ | 90° |
Cell volume | 2386.1 ± 0.4 Å3 |
Cell temperature | 173 ± 2 K |
Ambient diffraction temperature | 173 ± 2 K |
Number of distinct elements | 7 |
Space group number | 14 |
Hermann-Mauguin space group symbol | P 1 21/c 1 |
Hall space group symbol | -P 2ybc |
Residual factor for all reflections | 0.045 |
Residual factor for significantly intense reflections | 0.0274 |
Weighted residual factors for significantly intense reflections | 0.0641 |
Weighted residual factors for all reflections included in the refinement | 0.0746 |
Goodness-of-fit parameter for all reflections included in the refinement | 1.068 |
Diffraction radiation wavelength | 0.71073 Å |
Diffraction radiation type | MoKα |