Information card for entry 7219957
Formula |
C24 H19 Cd N3 O4 |
Calculated formula |
C24 H19 Cd N3 O4 |
Title of publication |
Solvothermal Synthesis, Structure, and Fluorescence Property of Three d10 Polymers Assembled From Semi-rigid V-shaped Azo-Bridged Multicarboxylate |
Authors of publication |
Tan, Yu-hui; Xiong, Jian-Bo; Gao, Ji-Xing; Xu, Qing; Fu, Chao-Wu; Tang, Yun Zhi; Yang, Shao-Ping; Wen, He-Rui; Shu, Qing |
Journal of publication |
RSC Adv. |
Year of publication |
2015 |
a |
11.667 ± 0.004 Å |
b |
9.677 ± 0.003 Å |
c |
19.32 ± 0.006 Å |
α |
90° |
β |
96.15 ± 0.004° |
γ |
90° |
Cell volume |
2168.7 ± 1.2 Å3 |
Cell temperature |
293 ± 2 K |
Ambient diffraction temperature |
293 ± 2 K |
Number of distinct elements |
5 |
Space group number |
14 |
Hermann-Mauguin space group symbol |
P 1 21/c 1 |
Hall space group symbol |
-P 2ybc |
Residual factor for all reflections |
0.0385 |
Residual factor for significantly intense reflections |
0.0319 |
Weighted residual factors for significantly intense reflections |
0.0643 |
Weighted residual factors for all reflections included in the refinement |
0.0674 |
Goodness-of-fit parameter for all reflections included in the refinement |
1.071 |
Diffraction radiation wavelength |
0.71073 Å |
Diffraction radiation type |
MoKα |
Yes |
No |
No |