Information card for entry 7219987
Common name | 1 |
Formula | C26 H20 Cl8 Hg4 N6 |
Calculated formula | C26 H20 Cl8 Hg4 N6 |
Title of publication | From monomers to polymers: steric and supramolecular effects on dimensionality of coordination architectures of heteroleptic mercury(ii) halogenide‒tetradentate Schiff base complexes |
Authors of publication | Mahmoudi, Ghodrat; Stilinović, Vladimir; Gargari, Masoumeh Servati; Bauzá, Antonio; Zaragoza, Guillermo; Kaminsky, Werner; Lynch, Vincent; Choquesillo-Lazarte, Duane; Sivakumar, K.; Khandar, Ali Akbar; Frontera, Antonio |
Journal of publication | CrystEngComm |
Year of publication | 2015 |
Journal volume | 17 |
Journal issue | 18 |
Pages of publication | 3493 |
a | 7.697 ± 0.0003 Å |
b | 15.919 ± 0.0005 Å |
c | 16.027 ± 0.0007 Å |
α | 104.891 ± 0.001° |
β | 101.344 ± 0.002° |
γ | 99.19 ± 0.004° |
Cell volume | 1814.35 ± 0.13 Å3 |
Cell temperature | 100 ± 2 K |
Ambient diffraction temperature | 100 ± 2 K |
Number of distinct elements | 5 |
Space group number | 2 |
Hermann-Mauguin space group symbol | P -1 |
Hall space group symbol | -P 1 |
Residual factor for all reflections | 0.1363 |
Residual factor for significantly intense reflections | 0.0787 |
Weighted residual factors for significantly intense reflections | 0.1929 |
Weighted residual factors for all reflections included in the refinement | 0.2325 |
Goodness-of-fit parameter for all reflections included in the refinement | 0.964 |
Diffraction radiation wavelength | 0.71073 Å |
Diffraction radiation type | MoKα |