Information card for entry 7219998
Formula | C40 H36 Ag N3 Nd2 O21 |
Calculated formula | C40 H36 Ag N3 Nd2 O21 |
Title of publication | Two series of Ln(iii)‒Ag(i) heterometallic‒organic frameworks constructed from isonicotinate and 2,2′-biphenyldicarboxylate: synthesis, structure and photoluminescence properties |
Authors of publication | Lin, Xiao-Ming; Ding, Yu-Jia; Liang, Shui-Mei; Ge, Si-Xiao; Wei, Lei-Ming; Xie, Ji-Qing; Zhang, Gang; Cai, Yue-Peng |
Journal of publication | CrystEngComm |
Year of publication | 2015 |
Journal volume | 17 |
Journal issue | 20 |
Pages of publication | 3800 |
a | 24.313 ± 0.012 Å |
b | 8.866 ± 0.004 Å |
c | 23.638 ± 0.012 Å |
α | 90° |
β | 103.544 ± 0.006° |
γ | 90° |
Cell volume | 4954 ± 4 Å3 |
Cell temperature | 296 ± 2 K |
Ambient diffraction temperature | 296 ± 2 K |
Number of distinct elements | 6 |
Space group number | 15 |
Hermann-Mauguin space group symbol | C 1 2/c 1 |
Hall space group symbol | -C 2yc |
Residual factor for all reflections | 0.1136 |
Residual factor for significantly intense reflections | 0.0967 |
Weighted residual factors for significantly intense reflections | 0.2915 |
Weighted residual factors for all reflections included in the refinement | 0.1794 |
Goodness-of-fit parameter for all reflections included in the refinement | 1.098 |
Diffraction radiation wavelength | 0.71073 Å |
Diffraction radiation type | MoKα |