Information card for entry 7220003
Formula | C40 H32 Ag N3 O19 Yb2 |
Calculated formula | C40 H32 Ag N3 O19 Yb2 |
Title of publication | Two series of Ln(iii)‒Ag(i) heterometallic‒organic frameworks constructed from isonicotinate and 2,2′-biphenyldicarboxylate: synthesis, structure and photoluminescence properties |
Authors of publication | Lin, Xiao-Ming; Ding, Yu-Jia; Liang, Shui-Mei; Ge, Si-Xiao; Wei, Lei-Ming; Xie, Ji-Qing; Zhang, Gang; Cai, Yue-Peng |
Journal of publication | CrystEngComm |
Year of publication | 2015 |
Journal volume | 17 |
Journal issue | 20 |
Pages of publication | 3800 |
a | 8.8785 ± 0.0009 Å |
b | 10.0812 ± 0.001 Å |
c | 13.9267 ± 0.0014 Å |
α | 97.738 ± 0.001° |
β | 107.737 ± 0.001° |
γ | 90.501 ± 0.001° |
Cell volume | 1174.8 ± 0.2 Å3 |
Cell temperature | 296 ± 2 K |
Ambient diffraction temperature | 296 ± 2 K |
Number of distinct elements | 6 |
Space group number | 2 |
Hermann-Mauguin space group symbol | P -1 |
Hall space group symbol | -P 1 |
Residual factor for all reflections | 0.0509 |
Residual factor for significantly intense reflections | 0.0468 |
Weighted residual factors for significantly intense reflections | 0.1284 |
Weighted residual factors for all reflections included in the refinement | 0.1316 |
Goodness-of-fit parameter for all reflections included in the refinement | 1.041 |
Diffraction radiation wavelength | 0.71073 Å |
Diffraction radiation type | MoKα |