Information card for entry 7220007
Chemical name | (E)-2-methoxy-6-{[(3-nitrophenyl)imino]methyl}phenol |
Formula | C14 H12 N2 O4 |
Calculated formula | C14 H12 N2 O4 |
SMILES | c1c(cc(cc1)/N=C/c1cccc(c1O)OC)N(=O)=O |
Title of publication | Solid-state investigation on a new dimorphic substituted N-salicylidene compound: insights into its thermochromic behaviour |
Authors of publication | Carletta, A.; Dubois, J.; Tilborg, A.; Wouters, J. |
Journal of publication | CrystEngComm |
Year of publication | 2015 |
Journal volume | 17 |
Journal issue | 18 |
Pages of publication | 3509 |
a | 4.7895 ± 0.0003 Å |
b | 11.3446 ± 0.001 Å |
c | 12.061 ± 0.0009 Å |
α | 93.472 ± 0.007° |
β | 100.357 ± 0.006° |
γ | 94.022 ± 0.006° |
Cell volume | 641.28 ± 0.09 Å3 |
Cell temperature | 293 ± 2 K |
Ambient diffraction temperature | 293 ± 2 K |
Number of distinct elements | 4 |
Space group number | 2 |
Hermann-Mauguin space group symbol | P -1 |
Hall space group symbol | -P 1 |
Residual factor for all reflections | 0.048 |
Residual factor for significantly intense reflections | 0.0414 |
Weighted residual factors for significantly intense reflections | 0.1195 |
Weighted residual factors for all reflections included in the refinement | 0.127 |
Goodness-of-fit parameter for all reflections included in the refinement | 1.064 |
Diffraction radiation wavelength | 1.54184 Å |
Diffraction radiation type | CuKα |