Information card for entry 7220012
Formula | C74 H52 Mn3 N4 O18 |
Calculated formula | C74 H40 Mn3 N4 O18 |
Title of publication | A family of coordination polymers assembled with a flexible hexacarboxylate ligand and auxiliary N-donor ligands: syntheses, structures, and physical properties |
Authors of publication | Zhang, Hong-Mei; Yang, Jin; Liu, Ying-Ying; Kang, Da-Wei; Ma, Jian-Fang |
Journal of publication | CrystEngComm |
Year of publication | 2015 |
Journal volume | 17 |
Journal issue | 16 |
Pages of publication | 3181 |
a | 11.429 ± 0.0007 Å |
b | 12.378 ± 0.0008 Å |
c | 12.766 ± 0.0009 Å |
α | 100.579 ± 0.005° |
β | 107.948 ± 0.006° |
γ | 100.603 ± 0.005° |
Cell volume | 1632.1 ± 0.2 Å3 |
Cell temperature | 293 ± 2 K |
Ambient diffraction temperature | 293 ± 2 K |
Number of distinct elements | 5 |
Space group number | 2 |
Hermann-Mauguin space group symbol | P -1 |
Hall space group symbol | -P 1 |
Residual factor for all reflections | 0.1298 |
Residual factor for significantly intense reflections | 0.0758 |
Weighted residual factors for significantly intense reflections | 0.1406 |
Weighted residual factors for all reflections included in the refinement | 0.1636 |
Goodness-of-fit parameter for all reflections included in the refinement | 1.145 |
Diffraction radiation wavelength | 0.71069 Å |
Diffraction radiation type | MoKα |