Information card for entry 7220019
Chemical name | 1,2,4-trichlorobenzene |
Formula | C6 H3 Cl3 |
Calculated formula | C6 H3 Cl3 |
SMILES | Clc1c(Cl)cc(Cl)cc1 |
Title of publication | Relations between compression and thermal contraction in 1,2,4-trichlorobenzene and melting of trichlorobenzene isomers |
Authors of publication | Bujak, Maciej; Podsiadło, Marcin; Katrusiak, Andrzej |
Journal of publication | CrystEngComm |
Year of publication | 2015 |
Journal volume | 17 |
Journal issue | 18 |
Pages of publication | 3446 |
a | 3.8788 ± 0.0005 Å |
b | 26.948 ± 0.003 Å |
c | 13.6006 ± 0.0013 Å |
α | 90° |
β | 93.164 ± 0.009° |
γ | 90° |
Cell volume | 1419.4 ± 0.3 Å3 |
Cell temperature | 270 ± 0.1 K |
Ambient diffraction temperature | 270 ± 0.1 K |
Ambient diffracton pressure | 100 kPa |
Number of distinct elements | 3 |
Space group number | 14 |
Hermann-Mauguin space group symbol | P 1 21/n 1 |
Hall space group symbol | -P 2yn |
Residual factor for all reflections | 0.1023 |
Residual factor for significantly intense reflections | 0.0756 |
Weighted residual factors for significantly intense reflections | 0.207 |
Weighted residual factors for all reflections included in the refinement | 0.2322 |
Goodness-of-fit parameter for all reflections included in the refinement | 1.091 |
Diffraction radiation wavelength | 0.71073 Å |
Diffraction radiation type | MoKα |