Information card for entry 7220022
Chemical name | 1,2,4-trichlorobenzene |
Formula | C6 H3 Cl3 |
Calculated formula | C6 H3 Cl3 |
SMILES | Clc1c(Cl)cc(Cl)cc1 |
Title of publication | Relations between compression and thermal contraction in 1,2,4-trichlorobenzene and melting of trichlorobenzene isomers |
Authors of publication | Bujak, Maciej; Podsiadło, Marcin; Katrusiak, Andrzej |
Journal of publication | CrystEngComm |
Year of publication | 2015 |
Journal volume | 17 |
Journal issue | 18 |
Pages of publication | 3446 |
a | 3.7825 ± 0.0007 Å |
b | 26.378 ± 0.003 Å |
c | 13.71 ± 0.04 Å |
α | 90° |
β | 93.76 ± 0.06° |
γ | 90° |
Cell volume | 1365 ± 4 Å3 |
Cell temperature | 295 ± 2 K |
Ambient diffraction temperature | 295 ± 2 K |
Ambient diffracton pressure | 640000 kPa |
Number of distinct elements | 3 |
Space group number | 14 |
Hermann-Mauguin space group symbol | P 1 21/n 1 |
Hall space group symbol | -P 2yn |
Residual factor for all reflections | 0.1279 |
Residual factor for significantly intense reflections | 0.1112 |
Weighted residual factors for significantly intense reflections | 0.284 |
Weighted residual factors for all reflections included in the refinement | 0.3072 |
Goodness-of-fit parameter for all reflections included in the refinement | 1.446 |
Diffraction radiation wavelength | 0.71073 Å |
Diffraction radiation type | MoKα |